{"text_format":"1","workbook":"xlsx","n_sheets":4,"sheets":["県税提出用①","県税提出用②","提出用控","記載要領"],"not_rendered":{"charts":0,"images":1,"macros":0,"external_links":0,"defined_names":4,"comments":0,"pivot_tables":0},"unopened":[],"bounds":{"document_bytes":16777216,"sheet_cells":100000,"rows_first":2000,"rows_last":500,"rows_between":2000,"halvings":0,"cell_chars":16384,"cell_head_chars":4096},"cells_cut":0,"cells_raw":0,"read":"whole","date_system":"1900"}

{"sheet":"県税提出用①","index":0,"n_rows":123,"n_cols":109,"rows_kept":123,"cut":false,"hidden":false,"merged":[[3,1,3,63],[7,1,8,63],[9,1,9,63],[62,12,63,16],[66,12,67,16],[20,1,21,11],[19,1,19,11],[60,1,61,11],[62,1,63,11],[66,1,67,11],[19,12,21,16],[22,12,23,16],[24,12,25,16],[26,12,27,16],[28,12,29,16],[30,12,31,16],[32,12,33,16],[34,12,35,16],[36,12,37,16],[38,12,39,16],[40,12,41,16],[42,12,43,16],[44,12,45,16],[58,12,59,16],[60,12,61,16],[42,1,43,11],[44,1,45,11],[46,1,47,11],[48,1,49,11],[50,1,51,11],[52,1,53,11],[54,1,55,11],[56,1,57,11],[58,1,59,11],[12,35,14,50],[12,11,14,13],[22,1,23,11],[56,17,56,68],[46,17,46,68],[40,17,40,68],[26,17,26,68],[24,1,25,11],[26,1,27,11],[28,1,29,11],[30,1,31,11],[32,1,33,11],[34,1,35,11],[36,1,37,11],[38,1,39,11],[40,1,41,11],[54,12,55,16],[56,12,57,16],[54,17,54,68],[48,12,49,16],[50,12,51,16],[46,12,47,16],[52,12,53,16],[17,12,18,117],[58,69,58,117],[60,17,60,68],[60,69,60,117],[62,17,62,68],[62,69,62,117],[52,17,52,68],[52,69,52,117],[66,17,66,68],[66,69,66,117],[24,69,24,117],[46,69,46,117],[48,17,48,68],[48,69,48,117],[50,17,50,68],[50,69,50,117],[28,17,28,68],[4,1,6,63],[5,90,5,92],[5,93,5,95],[5,96,5,98],[6,69,7,80],[6,81,7,117],[5,72,5,74],[30,17,30,68],[30,69,30,117],[32,17,32,68],[32,69,32,117],[42,17,42,68],[42,69,42,117],[44,17,44,68],[2,64,10,68],[12,16,14,21],[12,22,14,34],[2,99,3,107],[2,108,3,117],[4,99,4,102],[4,103,4,107],[4,108,4,112],[4,113,4,117],[2,69,3,98],[4,69,4,98],[40,69,40,117],[34,69,34,117],[36,69,36,117],[38,69,38,117],[26,69,26,117],[28,69,28,117],[8,69,9,74],[20,69,20,117],[22,69,22,117],[14,95,15,102],[14,103,16,117],[5,78,5,80],[5,81,5,83],[5,84,5,86],[5,87,5,89],[5,75,5,77],[64,1,65,11],[64,12,65,16],[64,17,64,68],[64,69,64,117],[17,1,18,11],[8,75,9,80],[8,81,9,86],[8,87,9,92],[8,93,9,98],[8,99,9,104],[8,105,9,110],[8,111,9,117],[11,95,12,102],[11,103,13,117],[22,17,22,68],[44,69,44,117],[34,17,34,68],[36,17,36,68],[38,17,38,68],[54,69,54,117],[56,69,56,117],[58,17,58,68],[12,14,14,15],[24,17,24,68]]}
[]
[]
[null,null,null,null,null,null,null,null,null,null,null,null,null,null,null,null,null,null,null,null,null,null,null,null,null,null,null,null,null,null,null,null,null,null,null,null,null,null,null,null,null,null,null,null,null,null,null,null,null,null,null,null,null,null,null,null,null,null,null,null,null,null,null,null,"※処理事項",null,null,null,null,"事業者コード",null,null,null,null,null,null,null,null,null,null,null,null,null,null,null,null,null,null,null,null,null,null,null,null,null,null,null,null,null,"処理\n区分",null,null,null,null,null,null,null,null,"申告\n区分"]
[null,"　申告者の氏名又は名称"]
[]
[]
[null,null,null,null,null,null,null,null,null,null,null,null,null,null,null,null,null,null,null,null,null,null,null,null,null,null,null,null,null,null,null,null,null,null,null,null,null,null,null,null,null,null,null,null,null,null,null,null,null,null,null,null,null,null,null,null,null,null,null,null,null,null,null,null,null,null,null,null,null,"予備",null,null,null,null,null,null,null,null,null,null,null,"申告年月日"]
[null,"　個人番号又は法人番号\n　 　    　　↓個人番号の記載に当たっては、左端を空欄とし、ここから記載してください。"]
[null,null,null,null,null,null,null,null,null,null,null,null,null,null,null,null,null,null,null,null,null,null,null,null,null,null,null,null,null,null,null,null,null,null,null,null,null,null,null,null,null,null,null,null,null,null,null,null,null,null,null,null,null,null,null,null,null,null,null,null,null,null,null,null,null,null,null,null,null,1,null,null,null,null,null,4]
[]
[]
[null,null,null,null,null,null,null,null,null,null,null,null,null,null,null,null,null,null,null,null,null,null,null,null,null,null,null,null,null,null,null,null,null,null,null,null,null,null,null,null,null,null,null,null,null,null,null,null,null,null,null,null,null,null,null,null,null,null,null,null,null,null,null,null,null,null,null,null,null,null,null,null,null,null,null,null,null,null,null,null,null,null,null,null,null,null,null,null,null,null,null,null,null,null,null,null,null,null,null,null,null,null,null,"枚のうち"]
[null,null,null,null,null,null,null,null,null,null,null,"令和",null,null,null,null,"年",null,null,null,null,null,null,null,null,null,null,null,null,null,null,null,null,null,null,"月分"]
[]
[null,null,null,null,null,null,null,null,null,null,null,null,null,null,null,null,null,null,null,null,null,null,null,null,null,null,null,null,null,null,null,null,null,null,null,null,null,null,null,null,null,null,null,null,null,null,null,null,null,null,null,null,null,null,null,null,null,null,null,null,null,null,null,null,null,null,null,null,null,null,null,null,null,null,null,null,null,null,null,null,null,null,null,null,null,null,null,null,null,null,null,null,null,null,null,null,null,null,null,null,null,null,null,"枚目"]
[]
[]
[null,"市町村名",null,null,null,null,null,null,null,null,null,null,"売渡し又は消費等の合計数量"]
[]
[]
[]
[]
[]
[]
[]
[]
[]
[]
[]
[]
[]
[]
[]
[]
[]
[]
[]
[]
[]
[]
{"$rows_left_out":84}
{"sheet":"県税提出用②","index":1,"n_rows":105,"n_cols":123,"rows_kept":105,"cut":false,"hidden":false,"merged":[[4,108,4,112],[6,29,6,117],[14,95,15,102],[8,99,9,104],[8,105,9,110],[8,111,9,117],[11,95,12,102],[2,69,3,98],[2,99,3,107],[2,108,3,117],[4,69,4,98],[4,113,4,117],[5,72,5,74],[5,75,5,77],[5,78,5,80],[5,81,5,83],[5,84,5,86],[5,87,5,89],[5,90,5,92],[4,99,4,102],[4,103,4,107],[8,61,10,68],[7,14,11,28],[11,35,14,94],[24,13,24,16],[24,17,24,68],[24,69,24,117],[17,95,17,102],[5,93,5,95],[5,96,5,98],[8,69,9,74],[8,75,9,80],[8,81,9,86],[8,87,9,92],[8,93,9,98],[20,69,20,117],[22,13,22,16],[22,17,22,68],[22,69,22,117],[32,13,32,16],[32,17,32,68],[32,69,32,117],[12,14,14,15],[12,16,14,21],[12,22,14,34],[28,13,28,16],[28,17,28,68],[28,69,28,117],[30,13,30,16],[30,17,30,68],[30,69,30,117],[26,13,26,16],[26,17,26,68],[26,69,26,117],[20,17,21,68],[36,13,36,16],[36,17,36,68],[36,69,36,117],[38,13,38,16],[38,17,38,68],[38,69,38,117],[34,13,34,16],[34,17,34,68],[34,69,34,117],[44,13,44,16],[44,17,44,68],[44,69,44,117],[46,13,46,16],[46,17,46,68],[46,69,46,117],[40,17,40,68],[40,69,40,117],[42,13,42,16],[42,17,42,68],[42,69,42,117],[52,17,52,68],[52,69,52,117],[54,13,54,16],[54,17,54,68],[54,69,54,117],[48,13,48,16],[48,17,48,68],[48,69,48,117],[50,13,50,16],[50,17,50,68],[50,69,50,117],[38,1,39,2],[52,13,52,16],[20,1,21,2],[40,13,40,16],[66,13,66,16],[66,17,66,68],[66,69,66,117],[22,1,23,2],[24,1,25,2],[26,1,27,2],[60,13,60,16],[60,17,60,68],[60,69,60,117],[62,13,62,16],[62,17,62,68],[62,69,62,117],[56,13,56,16],[56,17,56,68],[56,69,56,117],[58,13,58,16],[58,17,58,68],[58,69,58,117],[66,1,67,2],[62,1,63,2],[64,1,65,2],[64,13,64,16],[64,17,64,68],[64,69,64,117],[17,1,18,2],[19,1,19,2],[20,3,21,12],[20,13,20,16],[52,1,53,2],[54,1,55,2],[56,1,57,2],[58,1,59,2],[60,1,61,2],[40,1,41,2],[42,1,43,2],[44,1,45,2],[46,1,47,2],[48,1,49,2],[50,1,51,2],[28,1,29,2],[30,1,31,2],[32,1,33,2],[34,1,35,2],[36,1,37,2]]}
[]
[]
[null,null,null,null,null,null,null,null,null,null,null,null,null,null,null,null,null,null,null,null,null,null,null,null,null,null,null,null,null,null,null,null,null,null,null,null,null,null,null,null,null,null,null,null,null,null,null,null,null,null,null,null,null,null,null,null,null,null,null,null,null,null,null,null,null,null,null,null,null,"事業者コード",null,null,null,null,null,null,null,null,null,null,null,null,null,null,null,null,null,null,null,null,null,null,null,null,null,null,null,null,null,"処理\n区分",null,null,null,null,null,null,null,null,"申告\n区分"]
[]
[null,null,null,null,null,null,null,null,null,null,null,null,null,null,null,null,null,null,null,null,null,null,null,null,null,null,null,null,null,null,null,null,null,null,null,null,null,null,null,null,null,null,null,null,null,null,null,null,null,null,null,null,null,null,null,null,null,null,null,null,null,null,null,null,null,null,null,null,null,{"$f":"IF(県税提出用①!BR5=\"\",\"\",県税提出用①!BR5)","v":""}]
[]
[]
[]
[null,null,null,null,null,null,null,null,null,null,null,null,null,null,null,null,null,null,null,null,null,null,null,null,null,null,null,null,null,null,null,null,null,null,null,null,null,null,null,null,null,null,null,null,null,null,null,null,null,null,null,null,null,null,null,null,null,null,null,null,null,"オ",null,null,null,null,null,null,null,1,null,null,null,null,null,4]
[]
[]
[null,null,null,null,null,null,null,null,null,null,null,null,null,null,null,null,null,null,null,null,null,null,null,null,null,null,null,null,null,null,null,null,null,null,null,null,null,null,null,null,null,null,null,null,null,null,null,null,null,null,null,null,null,null,null,null,null,null,null,null,null,null,null,null,null,null,null,null,null,null,null,null,null,null,null,null,null,null,null,null,null,null,null,null,null,null,null,null,null,null,null,null,null,null,null,{"$f":"IF(県税提出用①!CR12=\"\",\"\",県税提出用①!CR12)","v":""}]
[null,null,null,null,null,null,null,null,null,null,null,null,null,null,{"$f":"IF(県税提出用①!O13=\"\",\"\",県税提出用①!O13)","v":""},null,null,null,null,null,null,null,{"$f":"IF(県税提出用①!W13=\"\",\"\",県税提出用①!W13)","v":""}]
[]
[null,null,null,null,null,null,null,null,null,null,null,null,null,null,null,null,null,null,null,null,null,null,null,null,null,null,null,null,null,null,null,null,null,null,null,null,null,null,null,null,null,null,null,null,null,null,null,null,null,null,null,null,null,null,null,null,null,null,null,null,null,null,null,null,null,null,null,null,null,null,null,null,null,null,null,null,null,null,null,null,null,null,null,null,null,null,null,null,null,null,null,null,null,null,null,{"$f":"IF(県税提出用①!CR15=\"\",\"\",県税提出用①!CR15)","v":""}]
[]
[]
[null,"カ"]
[]
[]
[null,"01",null,null,null,null,null,null,null,null,null,null,null,{"$f":"IF(ISERROR(VLOOKUP(県税提出用①!B21,$DR$72:$DS$105,2,FALSE)),\"\",VLOOKUP(県税提出用①!B21,$DR$72:$DS$105,2,FALSE))","v":""},null,null,null,null,null,null,null,null,null,null,null,null,null,null,null,null,null,null,null,null,null,null,null,null,null,null,null,null,null,null,null,null,null,null,null,null,null,null,null,null,null,null,null,null,null,null,null,null,null,null,null,null,null,null,null,{"$f":"IF(県税提出用①!BR21=\"\",\"\",県税提出用①!BR21)","v":""}]
[]
[null,"02",null,null,null,null,null,null,null,null,null,null,null,{"$f":"IF(ISERROR(VLOOKUP(県税提出用①!B23,$DR$72:$DS$105,2,FALSE)),\"\",VLOOKUP(県税提出用①!B23,$DR$72:$DS$105,2,FALSE))","v":""},null,null,null,null,null,null,null,null,null,null,null,null,null,null,null,null,null,null,null,null,null,null,null,null,null,null,null,null,null,null,null,null,null,null,null,null,null,null,null,null,null,null,null,null,null,null,null,null,null,null,null,null,null,null,null,{"$f":"IF(県税提出用①!BR23=\"\",\"\",県税提出用①!BR23)","v":""}]
[]
[null,"03",null,null,null,null,null,null,null,null,null,null,null,{"$f":"IF(ISERROR(VLOOKUP(県税提出用①!B25,$DR$72:$DS$105,2,FALSE)),\"\",VLOOKUP(県税提出用①!B25,$DR$72:$DS$105,2,FALSE))","v":""},null,null,null,null,null,null,null,null,null,null,null,null,null,null,null,null,null,null,null,null,null,null,null,null,null,null,null,null,null,null,null,null,null,null,null,null,null,null,null,null,null,null,null,null,null,null,null,null,null,null,null,null,null,null,null,{"$f":"IF(県税提出用①!BR25=\"\",\"\",県税提出用①!BR25)","v":""}]
[]
[null,"04",null,null,null,null,null,null,null,null,null,null,null,{"$f":"IF(ISERROR(VLOOKUP(県税提出用①!B27,$DR$72:$DS$105,2,FALSE)),\"\",VLOOKUP(県税提出用①!B27,$DR$72:$DS$105,2,FALSE))","v":""},null,null,null,null,null,null,null,null,null,null,null,null,null,null,null,null,null,null,null,null,null,null,null,null,null,null,null,null,null,null,null,null,null,null,null,null,null,null,null,null,null,null,null,null,null,null,null,null,null,null,null,null,null,null,null,{"$f":"IF(県税提出用①!BR27=\"\",\"\",県税提出用①!BR27)","v":""}]
[]
[null,"05",null,null,null,null,null,null,null,null,null,null,null,{"$f":"IF(ISERROR(VLOOKUP(県税提出用①!B29,$DR$72:$DS$105,2,FALSE)),\"\",VLOOKUP(県税提出用①!B29,$DR$72:$DS$105,2,FALSE))","v":""},null,null,null,null,null,null,null,null,null,null,null,null,null,null,null,null,null,null,null,null,null,null,null,null,null,null,null,null,null,null,null,null,null,null,null,null,null,null,null,null,null,null,null,null,null,null,null,null,null,null,null,null,null,null,null,{"$f":"IF(県税提出用①!BR29=\"\",\"\",県税提出用①!BR29)","v":""}]
[]
[null,"06",null,null,null,null,null,null,null,null,null,null,null,{"$f":"IF(ISERROR(VLOOKUP(県税提出用①!B31,$DR$72:$DS$105,2,FALSE)),\"\",VLOOKUP(県税提出用①!B31,$DR$72:$DS$105,2,FALSE))","v":""},null,null,null,null,null,null,null,null,null,null,null,null,null,null,null,null,null,null,null,null,null,null,null,null,null,null,null,null,null,null,null,null,null,null,null,null,null,null,null,null,null,null,null,null,null,null,null,null,null,null,null,null,null,null,null,{"$f":"IF(県税提出用①!BR31=\"\",\"\",県税提出用①!BR31)","v":""}]
[]
[null,"07",null,null,null,null,null,null,null,null,null,null,null,{"$f":"IF(ISERROR(VLOOKUP(県税提出用①!B33,$DR$72:$DS$105,2,FALSE)),\"\",VLOOKUP(県税提出用①!B33,$DR$72:$DS$105,2,FALSE))","v":""},null,null,null,null,null,null,null,null,null,null,null,null,null,null,null,null,null,null,null,null,null,null,null,null,null,null,null,null,null,null,null,null,null,null,null,null,null,null,null,null,null,null,null,null,null,null,null,null,null,null,null,null,null,null,null,{"$f":"IF(県税提出用①!BR33=\"\",\"\",県税提出用①!BR33)","v":""}]
[]
[null,"08",null,null,null,null,null,null,null,null,null,null,null,{"$f":"IF(ISERROR(VLOOKUP(県税提出用①!B35,$DR$72:$DS$105,2,FALSE)),\"\",VLOOKUP(県税提出用①!B35,$DR$72:$DS$105,2,FALSE))","v":""},null,null,null,null,null,null,null,null,null,null,null,null,null,null,null,null,null,null,null,null,null,null,null,null,null,null,null,null,null,null,null,null,null,null,null,null,null,null,null,null,null,null,null,null,null,null,null,null,null,null,null,null,null,null,null,{"$f":"IF(県税提出用①!BR35=\"\",\"\",県税提出用①!BR35)","v":""}]
[]
[null,"09",null,null,null,null,null,null,null,null,null,null,null,{"$f":"IF(ISERROR(VLOOKUP(県税提出用①!B37,$DR$72:$DS$105,2,FALSE)),\"\",VLOOKUP(県税提出用①!B37,$DR$72:$DS$105,2,FALSE))","v":""},null,null,null,null,null,null,null,null,null,null,null,null,null,null,null,null,null,null,null,null,null,null,null,null,null,null,null,null,null,null,null,null,null,null,null,null,null,null,null,null,null,null,null,null,null,null,null,null,null,null,null,null,null,null,null,{"$f":"IF(県税提出用①!BR37=\"\",\"\",県税提出用①!BR37)","v":""}]
[]
[null,"10",null,null,null,null,null,null,null,null,null,null,null,{"$f":"IF(ISERROR(VLOOKUP(県税提出用①!B39,$DR$72:$DS$105,2,FALSE)),\"\",VLOOKUP(県税提出用①!B39,$DR$72:$DS$105,2,FALSE))","v":""},null,null,null,null,null,null,null,null,null,null,null,null,null,null,null,null,null,null,null,null,null,null,null,null,null,null,null,null,null,null,null,null,null,null,null,null,null,null,null,null,null,null,null,null,null,null,null,null,null,null,null,null,null,null,null,{"$f":"IF(県税提出用①!BR39=\"\",\"\",県税提出用①!BR39)","v":""}]
[]
{"$rows_left_out":66}
{"sheet":"提出用控","index":2,"n_rows":67,"n_cols":109,"rows_kept":67,"cut":false,"hidden":false,"merged":[[28,69,28,117],[17,12,18,117],[4,1,6,63],[3,1,3,63],[7,1,8,63],[9,1,9,63],[4,99,4,102],[4,103,4,107],[2,64,10,68],[2,69,3,98],[2,99,3,107],[6,69,7,80],[6,81,7,117],[2,108,3,117],[4,69,4,98],[5,78,5,80],[5,81,5,83],[5,84,5,86],[5,87,5,89],[5,90,5,92],[5,93,5,95],[5,96,5,98],[4,108,4,112],[4,113,4,117],[14,95,15,102],[14,103,16,117],[17,1,18,11],[5,72,5,74],[5,75,5,77],[11,95,12,102],[11,103,13,117],[12,11,14,13],[12,14,14,15],[12,16,14,21],[12,22,14,34],[12,35,14,50],[8,69,9,74],[8,75,9,80],[8,81,9,86],[8,87,9,92],[8,93,9,98],[8,99,9,104],[8,105,9,110],[8,111,9,117],[19,12,21,16],[22,12,23,16],[30,1,31,11],[30,17,30,68],[30,69,30,117],[24,1,25,11],[24,17,24,68],[24,69,24,117],[26,1,27,11],[26,17,26,68],[26,69,26,117],[24,12,25,16],[26,12,27,16],[20,17,20,68],[20,69,20,117],[20,1,21,11],[19,1,19,11],[22,1,23,11],[22,17,22,68],[22,69,22,117],[28,12,29,16],[30,12,31,16],[28,1,29,11],[28,17,28,68],[32,17,32,68],[32,69,32,117],[34,1,35,11],[34,17,34,68],[34,69,34,117],[42,1,43,11],[40,12,41,16],[42,12,43,16],[50,12,51,16],[42,17,42,68],[42,69,42,117],[36,1,37,11],[36,17,36,68],[36,69,36,117],[38,1,39,11],[38,17,38,68],[38,69,38,117],[44,1,45,11],[44,17,44,68],[44,69,44,117],[46,1,47,11],[46,17,46,68],[46,69,46,117],[32,12,33,16],[34,12,35,16],[36,12,37,16],[38,12,39,16],[40,1,41,11],[40,17,40,68],[40,69,40,117],[32,1,33,11],[64,1,65,11],[64,12,65,16],[64,17,64,68],[64,69,64,117],[60,12,61,16],[62,12,63,16],[44,12,45,16],[46,12,47,16],[48,12,49,16],[52,1,53,11],[52,17,52,68],[52,69,52,117],[54,1,55,11],[54,17,54,68],[54,69,54,117],[48,1,49,11],[62,1,63,11],[66,1,67,11],[66,17,66,68],[66,69,66,117],[48,17,48,68],[48,69,48,117],[50,1,51,11],[50,17,50,68],[50,69,50,117],[66,12,67,16],[52,12,53,16],[54,12,55,16],[56,12,57,16],[58,12,59,16],[60,1,61,11],[60,17,60,68],[60,69,60,117],[56,1,57,11],[56,17,56,68],[56,69,56,117],[58,1,59,11],[62,17,62,68],[62,69,62,117],[58,17,58,68],[58,69,58,117]]}
[]
[]
[null,null,null,null,null,null,null,null,null,null,null,null,null,null,null,null,null,null,null,null,null,null,null,null,null,null,null,null,null,null,null,null,null,null,null,null,null,null,null,null,null,null,null,null,null,null,null,null,null,null,null,null,null,null,null,null,null,null,null,null,null,null,null,null,"※処理事項",null,null,null,null,"事業者コード",null,null,null,null,null,null,null,null,null,null,null,null,null,null,null,null,null,null,null,null,null,null,null,null,null,null,null,null,null,"処理\n区分",null,null,null,null,null,null,null,null,"申告\n区分"]
[null,"　申告者の氏名又は名称"]
[null,{"$f":"IF(県税提出用①!B5=\"\",\"\",県税提出用①!B5)","v":""},null,null,null,null,null,null,null,null,null,null,null,null,null,null,null,null,null,null,null,null,null,null,null,null,null,null,null,null,null,null,null,null,null,null,null,null,null,null,null,null,null,null,null,null,null,null,null,null,null,null,null,null,null,null,null,null,null,null,null,null,null,null,null,null,null,null,null,{"$f":"IF(県税提出用①!BR5=\"\",\"\",県税提出用①!BR5)","v":""}]
[]
[null,null,null,null,null,null,null,null,null,null,null,null,null,null,null,null,null,null,null,null,null,null,null,null,null,null,null,null,null,null,null,null,null,null,null,null,null,null,null,null,null,null,null,null,null,null,null,null,null,null,null,null,null,null,null,null,null,null,null,null,null,null,null,null,null,null,null,null,null,"予備",null,null,null,null,null,null,null,null,null,null,null,"申告年月日"]
[null,"　個人番号又は法人番号\n　 　    　　↓個人番号の記載に当たっては、左端を空欄とし、ここから記載してください。"]
[null,null,null,null,null,null,null,null,null,null,null,null,null,null,null,null,null,null,null,null,null,null,null,null,null,null,null,null,null,null,null,null,null,null,null,null,null,null,null,null,null,null,null,null,null,null,null,null,null,null,null,null,null,null,null,null,null,null,null,null,null,null,null,null,null,null,null,null,null,1,null,null,null,null,null,4]
[null,{"$f":"IF(県税提出用①!B10=\"\",\"\",県税提出用①!B10)","v":""}]
[]
[null,null,null,null,null,null,null,null,null,null,null,null,null,null,null,null,null,null,null,null,null,null,null,null,null,null,null,null,null,null,null,null,null,null,null,null,null,null,null,null,null,null,null,null,null,null,null,null,null,null,null,null,null,null,null,null,null,null,null,null,null,null,null,null,null,null,null,null,null,null,null,null,null,null,null,null,null,null,null,null,null,null,null,null,null,null,null,null,null,null,null,null,null,null,null,{"$f":"IF(県税提出用①!CR12=\"\",\"\",県税提出用①!CR12)","v":""},null,null,null,null,null,null,null,"枚のうち"]
[null,null,null,null,null,null,null,null,null,null,null,"令和",null,null,{"$f":"IF(県税提出用①!O13=\"\",\"\",県税提出用①!O13)","v":""},null,"年",null,null,null,null,null,{"$f":"IF(県税提出用①!W13=\"\",\"\",県税提出用①!W13)","v":""},null,null,null,null,null,null,null,null,null,null,null,null,"月分"]
[]
[null,null,null,null,null,null,null,null,null,null,null,null,null,null,null,null,null,null,null,null,null,null,null,null,null,null,null,null,null,null,null,null,null,null,null,null,null,null,null,null,null,null,null,null,null,null,null,null,null,null,null,null,null,null,null,null,null,null,null,null,null,null,null,null,null,null,null,null,null,null,null,null,null,null,null,null,null,null,null,null,null,null,null,null,null,null,null,null,null,null,null,null,null,null,null,{"$f":"IF(県税提出用①!CR15=\"\",\"\",県税提出用①!CR15)","v":""},null,null,null,null,null,null,null,"枚目"]
[]
[]
[null,"市町村名",null,null,null,null,null,null,null,null,null,null,"売渡し又は消費等の合計数量"]
[]
[]
[null,{"$f":"IF(県税提出用①!B21=\"\",\"\",県税提出用①!B21)","v":""},null,null,null,null,null,null,null,null,null,null,null,null,null,null,null,null,null,null,null,null,null,null,null,null,null,null,null,null,null,null,null,null,null,null,null,null,null,null,null,null,null,null,null,null,null,null,null,null,null,null,null,null,null,null,null,null,null,null,null,null,null,null,null,null,null,null,null,{"$f":"IF(県税提出用①!BR21=\"\",\"\",県税提出用①!BR21)","v":""}]
[]
[null,{"$f":"IF(県税提出用①!B23=\"\",\"\",県税提出用①!B23)","v":""},null,null,null,null,null,null,null,null,null,null,null,null,null,null,null,null,null,null,null,null,null,null,null,null,null,null,null,null,null,null,null,null,null,null,null,null,null,null,null,null,null,null,null,null,null,null,null,null,null,null,null,null,null,null,null,null,null,null,null,null,null,null,null,null,null,null,null,{"$f":"IF(県税提出用①!BR23=\"\",\"\",県税提出用①!BR23)","v":""}]
[]
[null,{"$f":"IF(県税提出用①!B25=\"\",\"\",県税提出用①!B25)","v":""},null,null,null,null,null,null,null,null,null,null,null,null,null,null,null,null,null,null,null,null,null,null,null,null,null,null,null,null,null,null,null,null,null,null,null,null,null,null,null,null,null,null,null,null,null,null,null,null,null,null,null,null,null,null,null,null,null,null,null,null,null,null,null,null,null,null,null,{"$f":"IF(県税提出用①!BR25=\"\",\"\",県税提出用①!BR25)","v":""}]
[]
[null,{"$f":"IF(県税提出用①!B27=\"\",\"\",県税提出用①!B27)","v":""},null,null,null,null,null,null,null,null,null,null,null,null,null,null,null,null,null,null,null,null,null,null,null,null,null,null,null,null,null,null,null,null,null,null,null,null,null,null,null,null,null,null,null,null,null,null,null,null,null,null,null,null,null,null,null,null,null,null,null,null,null,null,null,null,null,null,null,{"$f":"IF(県税提出用①!BR27=\"\",\"\",県税提出用①!BR27)","v":""}]
[]
[null,{"$f":"IF(県税提出用①!B29=\"\",\"\",県税提出用①!B29)","v":""},null,null,null,null,null,null,null,null,null,null,null,null,null,null,null,null,null,null,null,null,null,null,null,null,null,null,null,null,null,null,null,null,null,null,null,null,null,null,null,null,null,null,null,null,null,null,null,null,null,null,null,null,null,null,null,null,null,null,null,null,null,null,null,null,null,null,null,{"$f":"IF(県税提出用①!BR29=\"\",\"\",県税提出用①!BR29)","v":""}]
[]
[null,{"$f":"IF(県税提出用①!B31=\"\",\"\",県税提出用①!B31)","v":""},null,null,null,null,null,null,null,null,null,null,null,null,null,null,null,null,null,null,null,null,null,null,null,null,null,null,null,null,null,null,null,null,null,null,null,null,null,null,null,null,null,null,null,null,null,null,null,null,null,null,null,null,null,null,null,null,null,null,null,null,null,null,null,null,null,null,null,{"$f":"IF(県税提出用①!BR31=\"\",\"\",県税提出用①!BR31)","v":""}]
[]
[null,{"$f":"IF(県税提出用①!B33=\"\",\"\",県税提出用①!B33)","v":""},null,null,null,null,null,null,null,null,null,null,null,null,null,null,null,null,null,null,null,null,null,null,null,null,null,null,null,null,null,null,null,null,null,null,null,null,null,null,null,null,null,null,null,null,null,null,null,null,null,null,null,null,null,null,null,null,null,null,null,null,null,null,null,null,null,null,null,{"$f":"IF(県税提出用①!BR33=\"\",\"\",県税提出用①!BR33)","v":""}]
[]
[null,{"$f":"IF(県税提出用①!B35=\"\",\"\",県税提出用①!B35)","v":""},null,null,null,null,null,null,null,null,null,null,null,null,null,null,null,null,null,null,null,null,null,null,null,null,null,null,null,null,null,null,null,null,null,null,null,null,null,null,null,null,null,null,null,null,null,null,null,null,null,null,null,null,null,null,null,null,null,null,null,null,null,null,null,null,null,null,null,{"$f":"IF(県税提出用①!BR35=\"\",\"\",県税提出用①!BR35)","v":""}]
[]
[null,{"$f":"IF(県税提出用①!B37=\"\",\"\",県税提出用①!B37)","v":""},null,null,null,null,null,null,null,null,null,null,null,null,null,null,null,null,null,null,null,null,null,null,null,null,null,null,null,null,null,null,null,null,null,null,null,null,null,null,null,null,null,null,null,null,null,null,null,null,null,null,null,null,null,null,null,null,null,null,null,null,null,null,null,null,null,null,null,{"$f":"IF(県税提出用①!BR37=\"\",\"\",県税提出用①!BR37)","v":""}]
[]
[null,{"$f":"IF(県税提出用①!B39=\"\",\"\",県税提出用①!B39)","v":""},null,null,null,null,null,null,null,null,null,null,null,null,null,null,null,null,null,null,null,null,null,null,null,null,null,null,null,null,null,null,null,null,null,null,null,null,null,null,null,null,null,null,null,null,null,null,null,null,null,null,null,null,null,null,null,null,null,null,null,null,null,null,null,null,null,null,null,{"$f":"IF(県税提出用①!BR39=\"\",\"\",県税提出用①!BR39)","v":""}]
[]
{"$rows_left_out":28}
{"sheet":"記載要領","index":3,"n_rows":23,"n_cols":2,"rows_kept":23,"cut":false,"hidden":false,"merged":[]}
[]
[]
["　　第16号様式別表２記載要領"]
[null,"１　この明細書は、第16号様式の申告書・修正申告書又は第16号の３様式の申告"]
[null,"　書・修正申告書の「課税標準数量①」の欄の記載に係る製造たばこについて当"]
[null,"　該道府県の区域内の市町村ごとに売渡し又は消費等の合計数量の内訳を記載し、"]
[null,"　第16号様式の申告書・修正申告書又は第16号の３様式の申告書・修正申告書に"]
[null,"　添付すること。"]
[null,"２　※印の欄は、記載しないこと。"]
[null,"３　「個人番号又は法人番号」欄には、申告者が個人の場合は個人番号（行政手"]
[null,"　続における特定の個人を識別するための番号の利用等に関する法律第２条第５"]
[null,"　項に規定する個人番号をいう。）を記載し、法人の場合には法人番号（同条第"]
[null,"　15項に規定する法人番号をいう。）を記載すること。"]
[null,"４　「売渡し又は消費等の合計数量」とは、紙巻たばこ及び法第74条の４第２項"]
[null,"　ただし書に規定する葉巻たばこの本数、同項の表の上欄に掲げる製造たばこ（"]
[null,"　同項ただし書に規定する葉巻たばこは除く。）の重量を紙巻たばこの本数に換"]
[null,"　算したもの（この数値に小数点以下１位未満の端数があるときは、その端数を"]
[null,"　切り捨て、小数点以下１位まで算出したもの）及び加熱式たばこを同条第３項"]
[null,"　の規定により計算した紙巻たばこの本数の合計数の合計数量をいうものである"]
[null,"　こと。"]
[null,"５　市町村ごとの「売渡し又は消費等の合計数量」合計を末尾の欄に記載するこ"]
[null,"　と。"]
[null,"　"]